{"text_format":"1","workbook":"xlsx","n_sheets":10,"sheets":["Instructions","Unit Profile","Assessment","Summary","Action Plan","Database","Data","newcalc","conversion","Change Log"],"not_rendered":{"charts":1,"images":7,"macros":1,"external_links":1,"defined_names":53,"comments":4,"pivot_tables":0},"unopened":[],"bounds":{"document_bytes":16777216,"sheet_cells":100000,"rows_first":2000,"rows_last":500,"rows_between":2000,"halvings":0,"cell_chars":16384,"cell_head_chars":4096},"cells_cut":0,"cells_raw":0,"read":"whole","date_system":"1900"}

{"sheet":"Instructions","index":0,"n_rows":55,"n_cols":3,"rows_kept":55,"cut":false,"hidden":false,"merged":[]}
[]
[]
[]
[]
[]
[]
[]
[]
{"$rows_left_out":48}
{"sheet":"Unit Profile","index":1,"n_rows":36,"n_cols":28,"rows_kept":36,"cut":false,"hidden":false,"merged":[[35,1,36,21],[9,2,9,7],[9,10,9,13],[11,10,11,13],[13,2,13,7],[13,10,13,13],[11,2,11,7],[30,15,30,21],[32,15,32,21],[32,1,32,4],[32,6,32,7],[32,9,32,13],[3,1,6,21],[17,6,17,7],[16,9,16,13],[16,1,16,4],[16,6,16,7],[8,15,8,21],[17,9,28,13],[17,15,28,21],[16,15,16,21],[9,15,13,21],[17,1,28,4],[27,6,27,7],[23,6,23,7],[8,2,8,7],[25,6,25,7],[19,6,19,7],[8,10,8,13],[30,9,30,13],[21,6,21,7],[30,1,30,4],[30,6,30,7]]}
[]
[]
[]
[null,"Instructions:\n-Fill in Unit Hierarchy, Contact Information and the Assessment Start Date. If others are helping with the assessment, put their names in the User Comments. \n-Provide any additional comments in User Comments and refer to Supplementary Information for further details.\n-Select which categories of PI you are assessing, and the scope of the assessment (all PI or High-Risk PI only).  \n-Once the Unit Profile tab is complete, click the 'Start Assessment' button to launch the Assessment."]
[]
[]
[]
[]
{"$rows_left_out":29}
{"sheet":"Assessment","index":2,"n_rows":111,"n_cols":54,"rows_kept":111,"cut":false,"hidden":true,"merged":[[100,9,100,11],[100,2,100,7],[100,13,100,18],[100,34,100,37],[60,9,60,11],[62,9,62,11],[64,9,64,11],[67,9,67,11],[69,9,69,11],[71,9,71,11],[73,9,73,11],[76,9,76,11],[78,9,78,11],[81,9,81,11],[83,9,83,11],[85,9,85,11],[88,9,88,11],[96,2,96,7],[96,13,96,18],[96,34,96,37],[98,2,98,7],[98,13,98,18],[98,34,98,37],[96,9,96,11],[98,9,98,11],[91,2,91,7],[91,13,91,18],[91,34,91,37],[94,2,94,7],[94,13,94,18],[94,34,94,37],[91,9,91,11],[94,9,94,11],[91,27,91,32],[94,27,94,32],[96,27,96,32],[98,27,98,32],[91,20,91,25],[94,20,94,25],[96,20,96,25],[98,20,98,25],[85,2,85,7],[85,13,85,18],[85,34,85,37],[88,2,88,7],[88,13,88,18],[88,34,88,37],[81,2,81,7],[81,13,81,18],[81,34,81,37],[83,2,83,7],[83,13,83,18],[83,34,83,37],[81,27,81,32],[83,27,83,32],[85,27,85,32],[88,27,88,32],[81,20,81,25],[83,20,83,25],[85,20,85,25],[88,20,88,25],[76,2,76,7],[76,13,76,18],[76,34,76,37],[78,2,78,7],[78,13,78,18],[78,34,78,37],[71,2,71,7],[71,13,71,18],[71,34,71,37],[73,2,73,7],[73,13,73,18],[73,34,73,37],[71,27,71,32],[73,27,73,32],[76,27,76,32],[78,27,78,32],[71,20,71,25],[73,20,73,25],[76,20,76,25],[78,20,78,25],[53,2,53,7],[55,2,55,7],[48,13,48,18],[48,34,48,37],[67,2,67,7],[67,13,67,18],[67,34,67,37],[69,2,69,7],[69,13,69,18],[69,34,69,37],[62,2,62,7],[62,13,62,18],[62,34,62,37],[64,2,64,7],[64,13,64,18],[64,34,64,37],[64,27,64,32],[67,27,67,32],[69,27,69,32],[67,20,67,25],[69,20,69,25],[50,9,50,11],[53,27,53,32],[42,3,42,7],[44,3,44,7],[40,3,40,7],[36,9,36,11],[60,34,60,37],[60,2,60,7],[60,13,60,18],[57,13,57,18],[57,34,57,37],[48,9,48,11],[51,9,51,11],[53,9,53,11],[55,9,55,11],[57,9,57,11],[51,13,51,18],[51,34,51,37],[53,13,53,18],[53,34,53,37],[55,13,55,18],[55,34,55,37],[57,2,57,7],[58,2,58,7],[48,2,48,7],[51,2,51,7],[40,9,40,11],[42,9,42,11],[44,9,44,11],[36,13,36,18],[36,34,36,37],[38,13,38,18],[38,34,38,37],[40,13,40,18],[40,34,40,37],[36,27,36,32],[38,27,38,32],[40,27,40,32],[42,27,42,32],[44,27,44,32],[40,20,40,25],[42,20,42,25],[44,20,44,25],[42,34,42,37],[44,34,44,37],[29,9,29,11],[38,3,38,7],[25,2,25,7],[29,13,29,18],[29,34,29,37],[27,9,27,11],[29,2,29,7],[31,13,31,18],[31,34,31,37],[27,2,27,7],[32,2,32,7],[32,9,32,11],[32,13,32,18],[32,34,32,37],[36,3,36,7],[29,27,29,32],[31,27,31,32],[32,27,32,32],[29,20,29,25],[31,20,31,25],[32,20,32,25],[36,20,36,25],[38,20,38,25],[38,9,38,11],[21,9,21,11],[23,9,23,11],[23,13,23,18],[20,13,20,18],[27,13,27,18],[27,34,27,37],[25,9,25,11],[25,13,25,18],[25,34,25,37],[21,34,21,37],[23,34,23,37],[5,13,5,15],[5,2,5,3],[3,1,3,9],[3,13,3,15],[18,9,18,11],[18,2,18,7],[18,13,18,18],[16,3,16,7],[16,9,16,11],[16,13,16,18],[7,1,10,37],[12,2,12,7],[12,9,12,11],[12,13,12,18],[12,34,12,37],[14,34,14,37],[12,20,12,25],[21,2,21,7],[23,2,23,7],[14,2,14,7],[14,9,14,11],[16,34,16,37],[18,34,18,37],[21,13,21,18],[108,2,108,7],[108,9,108,11],[108,13,108,18],[108,34,108,37],[14,20,14,25],[16,20,16,25],[18,20,18,25],[20,20,20,25],[21,20,21,25],[23,20,23,25],[25,20,25,25],[27,20,27,25],[46,20,46,25],[46,27,46,32],[47,27,47,32],[48,27,48,32],[51,27,51,32],[110,2,110,7],[110,9,110,11],[110,13,110,18],[110,34,110,37],[102,2,102,7],[102,9,102,11],[102,13,102,18],[102,34,102,37],[104,2,104,7],[104,9,104,11],[104,13,104,18],[104,34,104,37],[106,2,106,7],[106,9,106,11],[106,13,106,18],[106,34,106,37],[110,27,110,32],[106,27,106,32],[108,27,108,32],[46,13,46,18],[14,13,14,18],[42,13,42,18],[47,13,47,18],[44,13,44,18],[3,34,3,35],[100,27,100,32],[102,27,102,32],[104,27,104,32],[55,27,55,32],[57,27,57,32],[60,27,60,32],[62,27,62,32],[12,27,12,32],[14,27,14,32],[16,27,16,32],[18,27,18,32],[20,27,20,32],[21,27,21,32],[23,27,23,32],[25,27,25,32],[27,27,27,32],[46,34,46,37],[47,34,47,37],[100,20,100,25],[102,20,102,25],[104,20,104,25],[106,20,106,25],[108,20,108,25],[110,20,110,25],[47,20,47,25],[48,20,48,25],[51,20,51,25],[53,20,53,25],[55,20,55,25],[57,20,57,25],[60,20,60,25],[62,20,62,25],[64,20,64,25]]}
[]
[]
[]
[null,"Assessment Progress",null,null,null,null,null,null,null,null,null,null,null,"Inherent Risk Rating",null,null,null,null,null,null,null,null,null,null,null,null,null,null,null,null,null,null,null,null,"Summary Results"]
[]
[null,{"$f":"100*progressPercent","v":0},"% completed",null,null,null,null,null,null,null,null,null,null,{"$f":"'Unit Profile'!AA33","v":"High"}]
[]
[null,"Instructions:\n1. Refer to Information Security Standards #1-9, and #11 as you complete the Assessment (all of the standards can be found here). Complete each question (the grey background colour of the response field will change once the question has been answered). There are different types of responses, depending on the question - simply choose the most appropriate response. The assessment uses the highest rating when a response has not been provided - please therefore ensure all questions are answered.\n2. Refer to the Supplementary Information for each question before you provide your response. Provide any additional comments in the User Comments field (e.g. a description of controls that are in place to address the requirement).\n3. During or after answering all questions, you can check your results by clicking the \"View Summary Results\" button."]
{"$rows_left_out":104}
{"sheet":"Summary","index":3,"n_rows":48,"n_cols":25,"rows_kept":48,"cut":false,"hidden":true,"merged":[[9,14,9,15],[9,17,9,20],[47,15,47,17],[45,15,45,17],[43,15,43,17],[29,15,29,17],[33,15,33,17],[31,15,31,17],[41,15,41,17],[39,15,39,17],[37,15,37,17],[35,15,35,17],[27,14,27,18],[17,1,17,20],[15,14,15,15],[15,17,15,20],[11,3,11,7],[13,3,13,7],[15,3,15,7],[13,9,13,12],[15,10,15,11],[9,10,11,11],[9,3,9,7],[3,1,5,20],[7,1,7,2],[7,14,7,15],[7,17,7,20],[7,3,7,7],[7,9,7,12],[13,14,13,15],[13,17,13,20],[21,3,21,11],[23,3,23,11],[25,3,25,11],[27,3,27,11],[19,3,19,11],[19,14,19,19],[21,14,21,18],[23,14,23,18],[25,14,25,18]]}
[]
[]
[]
[null,"Instructions:\n1. Fill in/update the Last Assessment Completed Date.\n2. View the Overall Risk Rating (top right corner, above the View Action Plan button).\n3. View the Risk Rating for each Focus Area (General, Privacy, Paper Security, Electronic Information Security).\n4. View the Risk Rating for each applicable Information Security Standard (click \"Expand EIS Standards\").\n5. If you would like to go back to the Assessment page, click the \"Return to Assessment Tab\" button."]
[]
[]
[]
[null,"Exec Unit",null,{"$f":"IF('Unit Profile'!$C$10=\"\",\"\",'Unit Profile'!$C$10)","v":""},null,null,null,null,null,"Categories of PI"]
{"$rows_left_out":41}
{"sheet":"Action Plan","index":4,"n_rows":101,"n_cols":66,"rows_kept":101,"cut":false,"hidden":true,"merged":[[96,53,96,58],[98,53,98,58],[100,53,100,58],[87,53,87,58],[88,53,88,58],[90,53,90,58],[91,53,91,58],[93,53,93,58],[94,53,94,58],[76,53,76,58],[78,53,78,58],[80,53,80,58],[81,53,81,58],[83,53,83,58],[85,53,85,58],[66,53,66,58],[67,53,67,58],[69,53,69,58],[71,53,71,58],[73,53,73,58],[75,53,75,58],[55,53,55,58],[57,53,57,58],[59,53,59,58],[60,53,60,58],[62,53,62,58],[64,53,64,58],[44,53,44,58],[47,53,47,58],[48,53,48,58],[50,53,50,58],[51,53,51,58],[53,53,53,58],[29,53,29,58],[32,53,32,58],[36,53,36,58],[38,53,38,58],[40,53,40,58],[42,53,42,58],[16,53,16,58],[18,53,18,58],[21,53,21,58],[23,53,23,58],[25,53,25,58],[27,53,27,58],[98,39,98,44],[98,46,98,51],[100,39,100,44],[100,46,100,51],[2,55,2,56],[4,55,4,56],[8,55,8,56],[10,55,10,56],[12,53,12,58],[14,53,14,58],[93,39,93,44],[93,46,93,51],[94,39,94,44],[94,46,94,51],[96,39,96,44],[96,46,96,51],[88,39,88,44],[88,46,88,51],[90,39,90,44],[90,46,90,51],[91,39,91,44],[91,46,91,51],[83,39,83,44],[83,46,83,51],[85,39,85,44],[85,46,85,51],[87,39,87,44],[87,46,87,51],[78,39,78,44],[78,46,78,51],[80,39,80,44],[80,46,80,51],[81,39,81,44],[81,46,81,51],[73,39,73,44],[73,46,73,51],[75,39,75,44],[75,46,75,51],[76,39,76,44],[76,46,76,51],[67,39,67,44],[67,46,67,51],[69,39,69,44],[69,46,69,51],[71,39,71,44],[71,46,71,51],[62,39,62,44],[62,46,62,51],[64,39,64,44],[64,46,64,51],[66,39,66,44],[66,46,66,51],[57,39,57,44],[57,46,57,51],[59,39,59,44],[59,46,59,51],[60,39,60,44],[60,46,60,51],[51,39,51,44],[51,46,51,51],[53,39,53,44],[53,46,53,51],[55,39,55,44],[55,46,55,51],[47,39,47,44],[47,46,47,51],[48,39,48,44],[48,46,48,51],[50,39,50,44],[50,46,50,51],[40,39,40,44],[40,46,40,51],[42,39,42,44],[42,46,42,51],[44,39,44,44],[44,46,44,51],[32,39,32,44],[32,46,32,51],[36,39,36,44],[36,46,36,51],[38,39,38,44],[38,46,38,51],[25,46,25,51],[27,39,27,44],[27,46,27,51],[29,39,29,44],[29,46,29,51],[18,39,18,44],[18,46,18,51],[21,39,21,44],[21,46,21,51],[23,39,23,44],[23,46,23,51],[12,39,12,44],[12,46,12,51],[14,39,14,44],[14,46,14,51],[16,39,16,44],[16,46,16,51],[98,32,98,37],[100,32,100,37],[2,41,2,42],[2,48,2,49],[4,41,4,42],[4,48,4,49],[8,41,8,42],[8,48,8,49],[10,41,10,42],[10,48,10,49],[88,32,88,37],[90,32,90,37],[91,32,91,37],[93,32,93,37],[94,32,94,37],[96,32,96,37],[78,32,78,37],[80,32,80,37],[81,32,81,37],[83,32,83,37],[85,32,85,37],[87,32,87,37],[67,32,67,37],[69,32,69,37],[71,32,71,37],[73,32,73,37],[75,32,75,37],[76,32,76,37],[57,32,57,37],[59,32,59,37],[60,32,60,37],[62,32,62,37],[64,32,64,37],[66,32,66,37],[47,32,47,37],[48,32,48,37],[50,32,50,37],[51,32,51,37],[53,32,53,37],[55,32,55,37],[36,32,36,37],[38,32,38,37],[40,32,40,37],[42,32,42,37],[44,32,44,37],[18,32,18,37],[21,32,21,37],[23,32,23,37],[25,32,25,37],[27,32,27,37],[29,32,29,37],[96,25,96,30],[98,25,98,30],[100,25,100,30],[2,34,2,35],[4,34,4,35],[8,34,8,35],[10,34,10,35],[12,32,12,37],[14,32,14,37],[16,32,16,37],[87,25,87,30],[88,25,88,30],[90,25,90,30],[91,25,91,30],[93,25,93,30],[94,25,94,30],[76,25,76,30],[78,25,78,30],[80,25,80,30],[81,25,81,30],[83,25,83,30],[85,25,85,30],[66,25,66,30],[67,25,67,30],[69,25,69,30],[71,25,71,30],[73,25,73,30],[75,25,75,30],[55,25,55,30],[57,25,57,30],[59,25,59,30],[60,25,60,30],[62,25,62,30],[64,25,64,30],[2,27,2,28],[4,27,4,28],[8,27,8,28],[10,27,10,28],[12,25,12,30],[14,25,14,30],[44,25,44,30],[47,25,47,30],[48,25,48,30],[29,25,29,30],[32,25,32,30],[36,25,36,30],[38,25,38,30],[40,25,40,30],[42,25,42,30],[62,2,62,7],[62,9,62,11],[62,13,62,18],[62,20,62,23],[55,2,55,7],[55,9,55,11],[16,25,16,30],[18,25,18,30],[21,25,21,30],[23,25,23,30],[25,25,25,30],[27,25,27,30],[50,25,50,30],[51,25,51,30],[53,25,53,30],[53,9,53,11],[53,13,53,18],[53,20,53,23],[47,13,47,18],[47,20,47,23],[48,2,48,7],[48,9,48,11],[48,13,48,18],[48,20,48,23],[57,13,57,18],[57,20,57,23],[50,9,50,11],[51,2,51,7],[51,9,51,11],[51,13,51,18],[51,20,51,23],[53,2,53,7],[44,3,44,7],[44,9,44,11],[44,13,44,18],[44,20,44,23],[46,20,46,23],[88,20,88,23],[91,2,91,7],[91,9,91,11],[91,13,91,18],[91,20,91,23],[83,2,83,7],[83,9,83,11],[83,13,83,18],[83,20,83,23],[87,13,87,18],[85,9,85,11],[85,13,85,18],[85,20,85,23],[93,13,93,18],[90,13,90,18],[2,2,2,3],[2,4,2,8],[2,10,2,13],[2,15,2,16],[4,4,4,8],[50,13,50,18],[59,13,59,18],[88,2,88,7],[88,9,88,11],[88,13,88,18],[8,15,8,16],[8,18,8,21],[58,2,58,7],[60,2,60,7],[60,9,60,11],[60,13,60,18],[60,20,60,23],[55,13,55,18],[55,20,55,23],[57,2,57,7],[57,9,57,11],[85,2,85,7],[98,2,98,7],[98,9,98,11],[98,13,98,18],[98,20,98,23],[100,2,100,7],[100,9,100,11],[100,13,100,18],[100,20,100,23],[94,2,94,7],[94,9,94,11],[94,13,94,18],[94,20,94,23],[96,2,96,7],[96,9,96,11],[96,13,96,18],[96,20,96,23],[78,2,78,7],[78,9,78,11],[78,13,78,18],[78,20,78,23],[81,2,81,7],[81,9,81,11],[81,13,81,18],[81,20,81,23],[80,13,80,18],[73,2,73,7],[73,9,73,11],[73,13,73,18],[73,20,73,23],[76,2,76,7],[76,9,76,11],[76,13,76,18],[76,20,76,23],[75,13,75,18],[69,2,69,7],[69,9,69,11],[69,13,69,18],[69,20,69,23],[71,2,71,7],[71,9,71,11],[71,13,71,18],[71,20,71,23],[64,2,64,7],[64,9,64,11],[64,13,64,18],[64,20,64,23],[67,2,67,7],[67,9,67,11],[67,13,67,18],[67,20,67,23],[66,13,66,18],[40,9,40,11],[40,13,40,18],[40,20,40,23],[42,3,42,7],[42,9,42,11],[42,13,42,18],[42,20,42,23],[36,3,36,7],[36,9,36,11],[36,13,36,18],[36,20,36,23],[38,3,38,7],[38,9,38,11],[38,13,38,18],[38,20,38,23],[40,3,40,7],[25,2,25,7],[25,9,25,11],[25,13,25,18],[25,20,25,23],[17,39,17,44],[31,20,31,23],[32,2,32,7],[32,9,32,11],[32,13,32,18],[32,20,32,23],[27,2,27,7],[27,9,27,11],[27,13,27,18],[27,20,27,23],[29,2,29,7],[29,9,29,11],[29,13,29,18],[29,20,29,23],[32,32,32,37],[25,39,25,44],[12,2,12,7],[12,9,12,11],[12,13,12,18],[12,20,12,23],[14,2,14,7],[14,9,14,11],[14,13,14,18],[14,20,14,23],[23,2,23,7],[23,9,23,11],[23,13,23,18],[23,20,23,23],[11,5,11,9],[20,20,20,23],[21,2,21,7],[21,9,21,11],[21,13,21,18],[21,20,21,23],[4,11,6,13],[4,15,4,16],[4,18,4,21],[6,4,6,8],[8,4,8,8],[8,10,8,13],[10,4,10,8],[10,11,10,12],[10,15,10,16],[10,18,10,21],[16,3,16,7],[16,9,16,11],[16,13,16,18],[16,20,16,23],[18,2,18,7],[18,9,18,11],[18,13,18,18],[18,20,18,23]]}
[]
[]
[null,null,"Exec Unit",null,{"$f":"Summary!D8","v":""},null,null,null,null,null,"Categories of PI",null,null,null,null,null,null,null,null,null,null,null,null,null,null,null,null,null,null,null,null,null,null,null,null,null,null,null,null,null,null,null,null,null,null,null,null,null,null,null,null,null,null,null,null,null,null,null,null,null,null,{"$f":"Data!J9","v":"Low"}]
[null,null,null,null,null,null,null,null,null,null,null,null,null,null,null,null,null,null,null,null,null,null,null,null,null,null,null,null,null,null,null,null,null,null,null,null,null,null,null,null,null,null,null,null,null,null,null,null,null,null,null,null,null,null,null,null,null,null,null,null,null,{"$f":"Data!J10","v":"Medium"}]
[null,null,"Unit",null,{"$f":"Summary!D10","v":""},null,null,null,null,null,null,{"$f":"Summary!K10","v":""},null,null,null,"Residual Risk Rating",null,null,{"$f":"Summary!R10","v":"Incomplete Assessment"},null,null,null,null,null,null,null,null,null,null,null,null,null,null,null,null,null,null,null,null,null,null,null,null,null,null,null,null,null,null,null,null,null,null,null,null,null,null,null,null,null,null,{"$f":"Data!J11","v":"High"}]
[null,null,null,null,null,null,null,null,null,null,null,null,null,null,null,null,null,null,null,null,null,null,null,null,null,null,null,null,null,null,null,null,null,null,null,null,null,null,null,null,null,null,null,null,null,null,null,null,null,null,null,null,null,null,null,null,null,null,null,null,null,{"$f":"Data!J12","v":"Very high"}]
[null,null,"Sub Unit",null,{"$f":"Summary!D12","v":""}]
[]
{"$rows_left_out":94}
{"sheet":"Database","index":5,"n_rows":47,"n_cols":16,"rows_kept":47,"cut":false,"hidden":true,"merged":[]}
[]
[null,null,null,null,null,null,null,null,null,null,"Total Count",{"$f":"COUNTIF(L5:L42,1)","v":37},{"$f":"COUNTIF(M5:M42,1)","v":21},12]
[]
[]
[null,"Standard Number /  Name","Question Category","Requirement #","Database ID","RAT Questions","Response Requirements","Supplementary  Information ","COPY THESE AND...","...PASTE VALUES HERE","Design Requirements","High","Medium","Low","Q Type","Operating Environment"]
[null,null,"General",null,1,"Have roles and responsibilities been assigned within your unit for key Privacy and Security tasks? ","Yes / No / Not Sure\n","Privacy and Information Security roles and responsibilities should be clearly defined and communicated (e.g. in Job Descriptions), on Unit websites). Roles and responsibilities should be aligned with http://www.universitycounsel.ubc.ca/files/2013/06/policy104.pdf",{"$f":"replaceURLsWithCodes(H6,Data!K$23:K$330,Data!J$23:J$330)","v":"Privacy and Information Security roles and responsibilities should be clearly defined and communicated (e.g. in Job Descriptions), on Unit websites). Roles and responsibilities should be aligned with <<Policy 104: Acceptable Use and Security of UBC Electronic Information and Systems>>"},"Privacy and Information Security roles and responsibilities should be clearly defined and communicated (e.g. in Job Descriptions), on Unit websites). Roles and responsibilities should be aligned with <<Policy 104: Acceptable Use and Security of UBC Electronic Information and Systems>>","Chris, this is a decision question and also should be rated from a risk perspective.\n\n-If 'yes' is selected then the user should be directed to question 1.1 below.\n\n-If ''no' is select, skip the question below. \n",1,1,null,null,"Yes"]
[null,null,"General",null,1.1000000000000001,"Do employees know who to contact within their unit for Privacy and Security matters?","Yes / No / Not Sure\n","Users must immediately report all suspected information security incidents as follows:\n●  to Information Security at security@ubc.ca or via phone to the IT Service Centre at 604-822-6141. Information Security will coordinate the incident as required in accordance with the UBC Incident Response Plan;\n●  to their supervisor and University IT Support Staff who are assigned to their unit; and\n●  where the incident involves physical security issues on a UBC campus, in addition to information security issues, to Campus Security.\n\nFor further information refer to http://cio.ubc.ca/sites/cio.ubc.ca/files/documents/standards/Std%2004%20Reporting%20Information%20Security%20Incidents.pdf\n\nFor all other security matters, employees should contact the employee in their unit with responsibility for information security.",{"$f":"replaceURLsWithCodes(H7,Data!K$23:K$330,Data!J$23:J$330)","v":"Users must immediately report all suspected information security incidents as follows:\n●  to Information Security at security@ubc.ca or via phone to the IT Service Centre at 604-822-6141. Information Security will coordinate the incident as required in accordance with the UBC Incident Response Plan;\n●  to their supervisor and University IT Support Staff who are assigned to their unit; and\n●  where the incident involves physical security issues on a UBC campus, in addition to information security issues, to Campus Security.\n\nFor further information refer to <<ISS #4:  Reporting Information Security Incidents>>\n\nFor all other security matters, employees should contact the employee in their unit with responsibility for information security."},"Users must immediately report all suspected information security incidents as follows:\n●  to Information Security at security@ubc.ca or via phone to the IT Service Centre at 604-822-6141. Information Security will coordinate the incident as required in accordance with the UBC Incident Response Plan;\n●  to their supervisor and University IT Support Staff who are assigned to their unit; and\n●  where the incident involves physical security issues on a UBC campus, in addition to information security issues, to Campus Security.\n\nFor further information refer to <<ISS #4:  Reporting Information Security Incidents>>\n\nFor all other security matters, employees should contact the employee in their unit with responsibility for information security.",null,1,1,null,null,"Yes"]
[null,null,"General",null,2,"Have all employees working with PI been made aware of the University's Information Security Standards, and fact sheets on privacy and paper-based security, which outline how PI must be collected, used and disclosed?","Yes / No / Not Sure\n","http://cio.ubc.ca/security-standards-home/information-security-policy-standards-and-resources\n\nhttp://universitycounsel.ubc.ca/access-and-privacy/privacy/\n\nhttp://www.library.ubc.ca/archives/manuals/SECURITY.pdf\n",{"$f":"replaceURLsWithCodes(H8,Data!K$23:K$330,Data!J$23:J$330)","v":"<<Information Security Standards>>\n\n<<Privacy Fact Sheets>>\n\n<<Information Security Fact Sheet: Security of Paper Records>>\n"},"<<Information Security Standards>>\n\n<<Privacy Fact Sheets>>\n\n<<Information Security Fact Sheet: Security of Paper Records>>\n",null,1,1,1,null,"Yes"]
{"$rows_left_out":40}
{"sheet":"Data","index":6,"n_rows":77,"n_cols":17,"rows_kept":77,"cut":false,"hidden":true,"merged":[[21,4,21,5]]}
[null,"Responses","Risk Ratings",null,"Range","Risk Ratings",null,null,"Options","Risk Ratings","PIOptions","PIOptions_shadow","PICategories",null,"Scope",null,"RiskRating"]
[null,"Yes",{"$f":"J2","v":1},null,"0-20% of cases",5,null,null,{"$f":"B2","v":"Yes"},{"$f":"F6","v":1},"None",{"$f":"K2","v":"None"},"EMP",null,"High-Risk PI Only",null,"High"]
[null,"No",{"$f":"J3","v":5},null,"21 - 40% of cases",4,null,null,{"$f":"B3","v":"No"},{"$f":"F2","v":5},"High-Risk PI",{"$f":"K3","v":"High-Risk PI"},"STU",null,"All PI",null,"Medium"]
[null,"Not Sure",5,null,"41 - 60% of cases",3,null,null,"Not Sure",{"$f":"F2","v":5},"Other PI","PI (Not High-Risk)","PHI",null,null,null,"Low"]
[null,{"$f":"E7","v":"Select an option"},null,null,"61 - 80% of cases",2,null,null,"N/A",{"$f":"F6","v":1},{"$f":"E7","v":"Select an option"},{"$f":"K5","v":"Select an option"},"DA"]
[null,null,null,null,"81 - 100% of cases",1,null,null,{"$f":"E7","v":"Select an option"},null,null,"see the comment on assessment!AP33","TP"]
[null,null,null,null,"Select an option",null,null,null,null,null,null,null,"PCI"]
[null,"for admins",null,null,null,null,null,"Inclusive lower","exclusive upper","Risk Rating",null,null,"Other"]
{"$rows_left_out":70}
{"sheet":"newcalc","index":7,"n_rows":102,"n_cols":64,"rows_kept":102,"cut":false,"hidden":true,"merged":[[4,0,4,6],[4,8,4,20]]}
[]
[]
[null,null,null,null,null,null,null,null,null,null,null,null,null,null,null,null,null,null,null,null,null,null,null,null,null,null,null,null,null,null,null,null,null,null,null,null,null,null,null,null,null,null,null,null,null,null,null,null,null,null,null,null,null,null,null,null,null,null,null,null,null,null,null,{"$f":"Data!J9","v":"Low"}]
[null,null,null,null,null,null,null,null,null,null,null,null,null,null,null,null,null,null,null,null,null,null,null,null,null,null,null,null,null,null,null,null,null,null,null,null,null,null,null,null,null,null,null,null,null,null,null,null,null,null,null,null,null,null,null,null,null,null,null,null,null,null,null,{"$f":"Data!J10","v":"Medium"}]
["Progress calculation",null,null,null,null,null,null,null,"%RR calculation",null,null,null,null,null,null,null,null,null,null,null,null,null,null,null,null,null,null,null,null,null,null,null,null,null,null,null,null,null,null,null,null,null,null,null,null,null,null,null,null,null,null,null,null,null,null,null,null,null,null,null,null,null,null,{"$f":"Data!J11","v":"High"}]
[null,null,"Not_selected_text:",null,{"$f":"Data!E7","v":"Select an option"},null,null,null,null,null,null,null,null,"\"Incomplete\"=",null,null,null,"Incomplete Assessment",null,null,null,null,null,null,null,null,null,null,null,null,null,null,null,null,null,null,null,null,null,null,null,null,null,null,null,null,null,null,null,null,null,null,null,null,null,null,null,null,null,null,null,null,null,{"$f":"Data!J12","v":"Very high"}]
[]
[null,null,"% progress",null,{"$f":"E11/C11","v":0}]
{"$rows_left_out":95}
{"sheet":"conversion","index":8,"n_rows":24,"n_cols":18,"rows_kept":24,"cut":false,"hidden":true,"merged":[]}
[null,"file extension ->","*.xlsm","."]
[null,"Source path->","C:\\Users\\Mushfiqur\\Desktop\\tmp\\testin","."]
[null,"Target path->","C:\\Users\\Mushfiqur\\Desktop\\tmp\\testout","."]
[]
[]
[]
[null,null,"Files",null,null,null,null,null,null,"conv stat","Description","clear on new","hold","Special","v2sheet","v2range","v3sheet","v3range"]
[null,"really? -->","--EMPTY--",null,null,null,null,null,null,null,"front page stuff",true,true,null,{"$f":"Q8","v":"Unit Profile"},"C10","Unit Profile","K10"]
{"$rows_left_out":17}
{"sheet":"Change Log","index":9,"n_rows":4,"n_cols":8,"rows_kept":4,"cut":false,"hidden":true,"merged":[[1,1,1,7]]}
["Change Management Log"]
[null,"The purpose of this sheet is to track any changes made to the PI Operating Environment tool v2.0 post go-live. [The approved baseline version was the go-live version that was distributed to the pilot groups on June 29, 2015 and is called PI Operating Environment Tool (v2.0) (development version1.95).]"]
[]
[null,"#","Version #","Worksheet (tab)","Description of the change made","Reason for change","Change Made By","Date of Change"]